# git rev-parse -q --verify 92edc4aef86780a8ad01b092c6d6630bb3cb423d^{commit} 92edc4aef86780a8ad01b092c6d6630bb3cb423d already have revision, skipping fetch # git checkout -q -f -B kisskb 92edc4aef86780a8ad01b092c6d6630bb3cb423d # git clean -qxdf # < git log -1 # commit 92edc4aef86780a8ad01b092c6d6630bb3cb423d # Author: Stephen Rothwell # Date: Fri Nov 13 18:05:26 2020 +1100 # # Add linux-next specific files for 20201113 # # Signed-off-by: Stephen Rothwell # < /opt/cross/kisskb/korg/gcc-4.9.4-nolibc/alpha-linux/bin/alpha-linux-gcc --version # < /opt/cross/kisskb/korg/gcc-4.9.4-nolibc/alpha-linux/bin/alpha-linux-ld --version # < git log --format=%s --max-count=1 92edc4aef86780a8ad01b092c6d6630bb3cb423d # < make -s -j 120 ARCH=alpha O=/kisskb/build/linux-next_alpha-defconfig_alpha-gcc4.9 CROSS_COMPILE=/opt/cross/kisskb/korg/gcc-4.9.4-nolibc/alpha-linux/bin/alpha-linux- defconfig # make -s -j 120 ARCH=alpha O=/kisskb/build/linux-next_alpha-defconfig_alpha-gcc4.9 CROSS_COMPILE=/opt/cross/kisskb/korg/gcc-4.9.4-nolibc/alpha-linux/bin/alpha-linux- :1515:2: warning: #warning syscall clone3 not implemented [-Wcpp] /kisskb/src/arch/alpha/kernel/entry.S: Assembler messages: /kisskb/src/arch/alpha/kernel/entry.S:547: Error: bad expression /kisskb/src/arch/alpha/kernel/entry.S:547: Error: syntax error make[2]: *** [/kisskb/src/scripts/Makefile.build:364: arch/alpha/kernel/entry.o] Error 1 make[2]: *** Waiting for unfinished jobs.... make[1]: *** [/kisskb/src/Makefile:1797: arch/alpha/kernel] Error 2 make[1]: *** Waiting for unfinished jobs.... make: *** [Makefile:185: __sub-make] Error 2 Command 'make -s -j 120 ARCH=alpha O=/kisskb/build/linux-next_alpha-defconfig_alpha-gcc4.9 CROSS_COMPILE=/opt/cross/kisskb/korg/gcc-4.9.4-nolibc/alpha-linux/bin/alpha-linux- ' returned non-zero exit status 2 # rm -rf /kisskb/build/linux-next_alpha-defconfig_alpha-gcc4.9 # Build took: 0:00:24.339219