Buildresult: linus/um-allyesconfig/um-x86_64-gcc12 built on Apr 27 2023, 15:26
kisskb
Revisions
|
Branches
|
Compilers
|
Configs
|
Build Results
|
Build Failures
|
Status:
Failed
Date/Time:
Apr 27 2023, 15:26
Duration:
0:11:35.544193
Builder:
ka7
Revision:
Merge tag 'f2fs-for-6.4-rc1' of git://git.kernel.org/pub/scm/linux/kernel/git/jaegeuk/f2fs (
5c7ecada25d2086aee607ff7deb69e77faa4aa92)
Target:
linus/um-allyesconfig/um-x86_64-gcc12
Branch:
linus
Compiler:
um-x86_64-gcc12
(x86_64-linux-gcc.br_real (Buildroot 2021.11-4428-g6b6741b) 12.2.0 / GNU ld (GNU Binutils) 2.39)
Config:
allyesconfig
(
download
)
Log:
Download original
Possible errors
drivers/spi/spi-stm32-qspi.c:523:27: error: 'op' is used uninitialized [-Werror=uninitialized] drivers/spi/spi-stm32-qspi.c:564:27: error: 'op' is used uninitialized [-Werror=uninitialized] cc1: all warnings being treated as errors make[4]: *** [scripts/Makefile.build:252: drivers/spi/spi-stm32-qspi.o] Error 1 make[3]: *** [scripts/Makefile.build:494: drivers/spi] Error 2 drivers/mtd/spi-nor/spansion.c:364:27: error: 'op' is used uninitialized [-Werror=uninitialized] drivers/mtd/spi-nor/spansion.c:495:27: error: 'op' is used uninitialized [-Werror=uninitialized] cc1: all warnings being treated as errors make[5]: *** [scripts/Makefile.build:252: drivers/mtd/spi-nor/spansion.o] Error 1 make[4]: *** [scripts/Makefile.build:494: drivers/mtd/spi-nor] Error 2 make[3]: *** [scripts/Makefile.build:494: drivers/mtd] Error 2 make[2]: *** [scripts/Makefile.build:494: drivers] Error 2 make[1]: *** [Makefile:2025: .] Error 2 make: *** [Makefile:226: __sub-make] Error 2
Possible warnings (4)
.config:12939:warning: override: reassigning to symbol GCC_PLUGIN_LATENT_ENTROPY .config:12943:warning: override: reassigning to symbol UML_NET_ETHERTAP .config:12945:warning: override: reassigning to symbol UML_NET_SLIP .config:12950:warning: override: reassigning to symbol UML_NET_SLIRP
Full Log
# git rev-parse -q --verify 5c7ecada25d2086aee607ff7deb69e77faa4aa92^{commit} 5c7ecada25d2086aee607ff7deb69e77faa4aa92 already have revision, skipping fetch # git checkout -q -f -B kisskb 5c7ecada25d2086aee607ff7deb69e77faa4aa92 # git clean -qxdf # < git log -1 # commit 5c7ecada25d2086aee607ff7deb69e77faa4aa92 # Merge: fbfaf03ebac9 8375be2b6414 # Author: Linus Torvalds <torvalds@linux-foundation.org> # Date: Wed Apr 26 09:42:10 2023 -0700 # # Merge tag 'f2fs-for-6.4-rc1' of git://git.kernel.org/pub/scm/linux/kernel/git/jaegeuk/f2fs # # Pull f2fs update from Jaegeuk Kim: # "In this round, we've mainly modified to support non-power-of-two zone # size, which is not required for f2fs by design. In order to avoid arch # dependency, we refactored the messy rb_entry structure shared across # different extent_cache. In addition to the improvement, we've also # fixed several subtle bugs and error cases. # # Enhancements: # - support non-power-of-two zone size for zoned device # - remove sharing the rb_entry structure in extent cache # - refactor f2fs_gc to call checkpoint in urgent condition # - support iopoll # # Bug fixes: # - fix potential corruption when moving a directory # - fix to avoid use-after-free for cached IPU bio # - fix the folio private usage # - avoid kernel warnings or panics in the cp_error case # - fix to recover quota data correctly # - fix some bugs in atomic operations # - fix system crash due to lack of free space in LFS # - fix null pointer panic in tracepoint in __replace_atomic_write_block # - fix iostat lock protection # - fix scheduling while atomic in decompression path # - preserve direct write semantics when buffering is forced # - fix to call f2fs_wait_on_page_writeback() in f2fs_write_raw_pages()" # # * tag 'f2fs-for-6.4-rc1' of git://git.kernel.org/pub/scm/linux/kernel/git/jaegeuk/f2fs: (52 commits) # f2fs: remove unnessary comment in __may_age_extent_tree # f2fs: allocate node blocks for atomic write block replacement # f2fs: use cow inode data when updating atomic write # f2fs: remove power-of-two limitation of zoned device # f2fs: allocate trace path buffer from names_cache # f2fs: add has_enough_free_secs() # f2fs: relax sanity check if checkpoint is corrupted # f2fs: refactor f2fs_gc to call checkpoint in urgent condition # f2fs: remove folio_detach_private() in .invalidate_folio and .release_folio # f2fs: remove bulk remove_proc_entry() and unnecessary kobject_del() # f2fs: support iopoll method # f2fs: remove batched_trim_sections node description # f2fs: fix to check return value of inc_valid_block_count() # f2fs: fix to check return value of f2fs_do_truncate_blocks() # f2fs: fix passing relative address when discard zones # f2fs: fix potential corruption when moving a directory # f2fs: add radix_tree_preload_end in error case # f2fs: fix to recover quota data correctly # f2fs: fix to check readonly condition correctly # docs: f2fs: Correct instruction to disable checkpoint # ... # < /opt/cross/kisskb/x86-64--glibc--bleeding-edge-2022.08-1/bin/x86_64-linux-gcc --version # < /opt/cross/kisskb/x86-64--glibc--bleeding-edge-2022.08-1/bin/x86_64-linux-ld --version # < git log --format=%s --max-count=1 5c7ecada25d2086aee607ff7deb69e77faa4aa92 # < make -s -j 32 ARCH=um O=/kisskb/build/linus_um-allyesconfig_um-x86_64-gcc12 CROSS_COMPILE=/opt/cross/kisskb/x86-64--glibc--bleeding-edge-2022.08-1/bin/x86_64-linux- SUBARCH=x86_64 allyesconfig # Added to kconfig CONFIG_STANDALONE=y # Added to kconfig CONFIG_KCOV=n # Added to kconfig CONFIG_GCC_PLUGINS=n # Added to kconfig CONFIG_GCC_PLUGIN_CYC_COMPLEXITY=n # Added to kconfig CONFIG_GCC_PLUGIN_SANCOV=n # Added to kconfig CONFIG_GCC_PLUGIN_LATENT_ENTROPY=n # Added to kconfig CONFIG_GCC_PLUGIN_STRUCTLEAK=n # Added to kconfig CONFIG_GCC_PLUGIN_RANDSTRUCT=n # Added to kconfig CONFIG_UML_NET=n # Added to kconfig CONFIG_UML_NET_ETHERTAP=n # Added to kconfig CONFIG_UML_NET_TUNTAP=n # Added to kconfig CONFIG_UML_NET_SLIP=n # Added to kconfig CONFIG_UML_NET_DAEMON=n # Added to kconfig CONFIG_UML_NET_VDE=n # Added to kconfig CONFIG_UML_NET_MCAST=n # Added to kconfig CONFIG_UML_NET_PCAP=n # Added to kconfig CONFIG_UML_NET_SLIRP=n # Added to kconfig CONFIG_GCOV_KERNEL=n # Added to kconfig CONFIG_DEBUG_INFO_BTF=n # Added to kconfig CONFIG_BPF_PRELOAD=n # < make -s -j 32 ARCH=um O=/kisskb/build/linus_um-allyesconfig_um-x86_64-gcc12 CROSS_COMPILE=/opt/cross/kisskb/x86-64--glibc--bleeding-edge-2022.08-1/bin/x86_64-linux- SUBARCH=x86_64 help # make -s -j 32 ARCH=um O=/kisskb/build/linus_um-allyesconfig_um-x86_64-gcc12 CROSS_COMPILE=/opt/cross/kisskb/x86-64--glibc--bleeding-edge-2022.08-1/bin/x86_64-linux- SUBARCH=x86_64 olddefconfig .config:12939:warning: override: reassigning to symbol GCC_PLUGIN_LATENT_ENTROPY .config:12943:warning: override: reassigning to symbol UML_NET_ETHERTAP .config:12945:warning: override: reassigning to symbol UML_NET_SLIP .config:12950:warning: override: reassigning to symbol UML_NET_SLIRP # make -s -j 32 ARCH=um O=/kisskb/build/linus_um-allyesconfig_um-x86_64-gcc12 CROSS_COMPILE=/opt/cross/kisskb/x86-64--glibc--bleeding-edge-2022.08-1/bin/x86_64-linux- SUBARCH=x86_64 /kisskb/src/drivers/spi/spi-stm32-qspi.c: In function 'stm32_qspi_dirmap_read': /kisskb/src/drivers/spi/spi-stm32-qspi.c:523:27: error: 'op' is used uninitialized [-Werror=uninitialized] 523 | struct spi_mem_op op; | ^~ /kisskb/src/drivers/spi/spi-stm32-qspi.c:523:27: note: 'op' declared here 523 | struct spi_mem_op op; | ^~ /kisskb/src/drivers/spi/spi-stm32-qspi.c: In function 'stm32_qspi_transfer_one_message': /kisskb/src/drivers/spi/spi-stm32-qspi.c:564:27: error: 'op' is used uninitialized [-Werror=uninitialized] 564 | struct spi_mem_op op; | ^~ /kisskb/src/drivers/spi/spi-stm32-qspi.c:564:27: note: 'op' declared here 564 | struct spi_mem_op op; | ^~ cc1: all warnings being treated as errors make[4]: *** [/kisskb/src/scripts/Makefile.build:252: drivers/spi/spi-stm32-qspi.o] Error 1 make[3]: *** [/kisskb/src/scripts/Makefile.build:494: drivers/spi] Error 2 make[3]: *** Waiting for unfinished jobs.... /kisskb/src/drivers/mtd/spi-nor/spansion.c: In function 'cypress_nor_set_addr_mode_nbytes': /kisskb/src/drivers/mtd/spi-nor/spansion.c:364:27: error: 'op' is used uninitialized [-Werror=uninitialized] 364 | struct spi_mem_op op; | ^~ /kisskb/src/drivers/mtd/spi-nor/spansion.c:364:27: note: 'op' declared here 364 | struct spi_mem_op op; | ^~ /kisskb/src/drivers/mtd/spi-nor/spansion.c: In function 's25fs256t_post_bfpt_fixup': /kisskb/src/drivers/mtd/spi-nor/spansion.c:495:27: error: 'op' is used uninitialized [-Werror=uninitialized] 495 | struct spi_mem_op op; | ^~ /kisskb/src/drivers/mtd/spi-nor/spansion.c:495:27: note: 'op' declared here 495 | struct spi_mem_op op; | ^~ cc1: all warnings being treated as errors make[5]: *** [/kisskb/src/scripts/Makefile.build:252: drivers/mtd/spi-nor/spansion.o] Error 1 make[5]: *** Waiting for unfinished jobs.... make[4]: *** [/kisskb/src/scripts/Makefile.build:494: drivers/mtd/spi-nor] Error 2 make[4]: *** Waiting for unfinished jobs.... make[3]: *** [/kisskb/src/scripts/Makefile.build:494: drivers/mtd] Error 2 make[2]: *** [/kisskb/src/scripts/Makefile.build:494: drivers] Error 2 make[1]: *** [/kisskb/src/Makefile:2025: .] Error 2 make: *** [Makefile:226: __sub-make] Error 2 Command 'make -s -j 32 ARCH=um O=/kisskb/build/linus_um-allyesconfig_um-x86_64-gcc12 CROSS_COMPILE=/opt/cross/kisskb/x86-64--glibc--bleeding-edge-2022.08-1/bin/x86_64-linux- SUBARCH=x86_64 ' returned non-zero exit status 2 # rm -rf /kisskb/build/linus_um-allyesconfig_um-x86_64-gcc12 # Build took: 0:11:35.544193
© Michael Ellerman 2006-2018.